{"text_format":"1","workbook":"xlsx","n_sheets":16,"sheets":["TELA INICIAL","INICIAL IRPJ","INICIAL CSLL","IR 1 TRIM","IR 2 TRIM","IR 3 TRIM","IR 4º TRIM","CSLL 1 TRIM","CSLL 2 TRIM","CSLL 3 TRIM","CSLL 4 TRIM","PIS","COFINS","Relatório","DASHBOARD","Configs"],"not_rendered":{"charts":1,"images":0,"macros":1,"external_links":2,"defined_names":7,"comments":0,"pivot_tables":1},"unopened":[],"bounds":{"document_bytes":16777216,"sheet_cells":100000,"rows_first":2000,"rows_last":500,"rows_between":2000,"halvings":0,"cell_chars":16384,"cell_head_chars":4096},"cells_cut":0,"cells_raw":0,"read":"whole","date_system":"1900"}

{"sheet":"TELA INICIAL","index":0,"n_rows":22,"n_cols":26,"rows_kept":22,"cut":false,"hidden":false,"merged":[[7,8,7,13],[9,8,9,9],[21,18,21,20]]}
[]
[]
[]
[]
[]
[]
[null,null,null,null,null,null,null,null,null,null,null,null,null,null,null,null,null,null,null,null,null,null,null,null,null,"X"]
[null,null,null,null,null,null,null,"Empresa: ","EMPRESA"]
[null,null,null,null,null,null,null,null,null,null,null,null,null,null,null,null,null,null,null,null,null,null,null,null,null,"NOVO"]
[null,null,null,null,null,null,null,"Ano:",2025,null,null,null,null,null,null,null,null,null,null,null,null,null,null,null,null,"<"]
[null,null,null,null,null,null,null,null,null,null,null,null,null,null,null,null,null,null,null,null,null,null,null,null,null,"!"]
[]
[]
[]
[]
[]
[]
[]
[]
[]
{"$rows_left_out":3}
{"sheet":"INICIAL IRPJ","index":1,"n_rows":22,"n_cols":19,"rows_kept":22,"cut":false,"hidden":false,"merged":[[21,18,21,20]]}
[]
[]
[]
[]
[]
[]
[]
[]
[]
[]
[]
[]
[]
[]
[]
[]
[]
[]
[]
[]
{"$rows_left_out":3}
{"sheet":"INICIAL CSLL","index":2,"n_rows":22,"n_cols":19,"rows_kept":22,"cut":false,"hidden":false,"merged":[[21,18,21,20]]}
[]
[]
[]
[]
[]
[]
[]
[]
[]
[]
[]
[]
[]
[]
[]
[]
[]
[]
[]
[]
{"$rows_left_out":3}
{"sheet":"IR 1 TRIM","index":3,"n_rows":41,"n_cols":5,"rows_kept":41,"cut":false,"hidden":false,"merged":[]}
[{"$f":"\"Empresa: \"&'TELA INICIAL'!I8","v":"Empresa: EMPRESA"}]
[{"$f":"\"Ano: \"&'TELA INICIAL'!I10","v":"Ano: 2025"}]
[]
["Ficha IRPJ 1º Trimestre","Janeiro","Fevereiro","Março","1º Trimestre"]
["DISCRIMINAÇÃO DA RECEITA BRUTA",{"$f":"SUM(B6:B9)","v":0},{"$f":"SUM(C6:C9)","v":0},0,{"$f":"SUM(B5:D5)","v":0}]
["01. Receita Bruta sujeita ao Percentual de 1,6%",null,null,null,{"$f":"SUM(B6:D6)","v":0}]
["02. Receita Bruta sujeita ao Percentual de 8%",null,null,null,{"$f":"SUM(B7:D7)","v":0}]
["03. Receita Bruta sujeita ao Percentual de 16%",null,null,null,0]
["04. Receita Bruta sujeita ao Percentual de 32%",null,null,null,0]
["05. RESULTADO DA APLICAÇÃO DOS PERCENTUAIS SOBRE A RECEITA BRUTA",{"$f":"(B6*1.6%)+(B7*8%)+(B8*6%)+(B9*32%)","v":0},{"$f":"(C6*1.6%)+(C7*8%)+(C8*6%)+(C9*32%)","v":0},0,{"$f":"SUM(B10:D10)","v":0}]
["06. Rendimentos e Ganhos Líquidos Aplicações Renda Fixa/Renda Variável",null,null,null,{"$f":"SUM(B11:D11)","v":0}]
["07. Juros sobre o Capital Próprio",0,0,0,{"$f":"SUM(B12:D12)","v":0}]
["08. Lucro Inflacionário - Realização Obrigatória",0,0,0,0]
["09. Realização de Valores cuja Tributação tenha sido Diferida",0,0,0,0]
["10. Recuperação de Custos e Despesas",0,0,0,0]
["11. Ajustes Decorrentes de Métodos - Preços de Transferência",0,0,0,0]
["12. Multas e Vantagens Decorrentes de Rescisão Contratual",0,0,0,0]
["13. Lucros Disponibilizados no Exterior",0,0,0,0]
["14. Rendimentos e Ganhos de Capital auferidos no Exterior",0,0,0,0]
["15. Variações Cambiais Ativas - Operações Liquidadas (MP 1.858-10/1999, art 30)",0,0,0,0]
{"$rows_left_out":22}
{"sheet":"IR 2 TRIM","index":4,"n_rows":41,"n_cols":5,"rows_kept":41,"cut":false,"hidden":false,"merged":[]}
[{"$f":"\"Empresa: \"&'TELA INICIAL'!I8","v":"Empresa: EMPRESA"}]
[{"$f":"\"Ano: \"&'TELA INICIAL'!I10","v":"Ano: 2025"}]
[]
["Ficha IRPJ 2º Trimestre","Abril","Maio","Junho","2º Trimestre"]
["DISCRIMINAÇÃO DA RECEITA BRUTA",{"$f":"SUM(B6:B9)","v":0},{"$f":"SUM(C6:C9)","v":0},{"$f":"SUM(D6:D9)","v":0},{"$f":"SUM(B5:D5)","v":0}]
["01. Receita Bruta sujeita ao Percentual de 1,6%",null,null,null,{"$f":"SUM(B6:D6)","v":0}]
["02. Receita Bruta sujeita ao Percentual de 8%",null,null,null,{"$f":"SUM(B7:D7)","v":0}]
["03. Receita Bruta sujeita ao Percentual de 16%",null,null,null,0]
["04. Receita Bruta sujeita ao Percentual de 32%",null,null,null,0]
["05. RESULTADO DA APLICAÇÃO DOS PERCENTUAIS SOBRE A RECEITA BRUTA",{"$f":"(B6*1.6%)+(B7*8%)+(B8*16%)+(B9*32%)","v":0},{"$f":"(C6*1.6%)+(C7*8%)+(C8*16%)+(C9*32%)","v":0},0,{"$f":"SUM(B10:D10)","v":0}]
["06. Rendimentos e Ganhos Líquidos Aplicações Renda Fixa/Renda Variável",0,0,null,{"$f":"SUM(B11:D11)","v":0}]
["07. Juros sobre o Capital Próprio",0,0,0,{"$f":"SUM(B12:D12)","v":0}]
["08. Lucro Inflacionário - Realização Obrigatória",0,0,0,0]
["09. Realização de Valores cuja Tributação tenha sido Diferida",0,0,0,0]
["10. Recuperação de Custos e Despesas",0,0,0,0]
["11. Ajustes Decorrentes de Métodos - Preços de Transferência",0,0,0,0]
["12. Multas e Vantagens Decorrentes de Rescisão Contratual",0,0,0,0]
["13. Lucros Disponibilizados no Exterior",0,0,0,0]
["14. Rendimentos e Ganhos de Capital auferidos no Exterior",0,0,0,0]
["15. Variações Cambiais Ativas - Operações Liquidadas (MP 1.858-10/1999, art 30)",0,0,0,0]
{"$rows_left_out":22}
{"sheet":"IR 3 TRIM","index":5,"n_rows":41,"n_cols":5,"rows_kept":41,"cut":false,"hidden":false,"merged":[]}
[{"$f":"\"Empresa: \"&'TELA INICIAL'!I8","v":"Empresa: EMPRESA"}]
[{"$f":"\"Ano: \"&'TELA INICIAL'!I10","v":"Ano: 2025"}]
[]
["Ficha IRPJ 3º Trimestre","Julho","Agosto","Setembro","3º Trimestre"]
["DISCRIMINAÇÃO DA RECEITA BRUTA",{"$f":"SUM(B6:B9)","v":0},{"$f":"SUM(C6:C9)","v":0},{"$f":"SUM(D6:D9)","v":0},{"$f":"SUM(B5:D5)","v":0}]
["01. Receita Bruta sujeita ao Percentual de 1,6%",null,null,null,{"$f":"SUM(B6:D6)","v":0}]
["02. Receita Bruta sujeita ao Percentual de 8%",null,null,null,{"$f":"SUM(B7:D7)","v":0}]
["03. Receita Bruta sujeita ao Percentual de 16%",null,null,null,0]
["04. Receita Bruta sujeita ao Percentual de 32%",null,null,null,0]
["05. RESULTADO DA APLICAÇÃO DOS PERCENTUAIS SOBRE A RECEITA BRUTA",{"$f":"(B6*1.6%)+(B7*8%)+(B8*16%)+(B9*32%)","v":0},{"$f":"(C6*1.6%)+(C7*8%)+(C8*16%)+(C9*32%)","v":0},0,{"$f":"SUM(B10:D10)","v":0}]
["06. Rendimentos e Ganhos Líquidos Aplicações Renda Fixa/Renda Variável",null,null,null,{"$f":"SUM(B11:D11)","v":0}]
["07. Juros sobre o Capital Próprio",0,0,0,{"$f":"SUM(B12:D12)","v":0}]
["08. Lucro Inflacionário - Realização Obrigatória",0,0,0,0]
["09. Realização de Valores cuja Tributação tenha sido Diferida",0,0,0,0]
["10. Recuperação de Custos e Despesas",0,0,0,0]
["11. Ajustes Decorrentes de Métodos - Preços de Transferência",0,0,0,0]
["12. Multas e Vantagens Decorrentes de Rescisão Contratual",0,0,0,0]
["13. Lucros Disponibilizados no Exterior",0,0,0,0]
["14. Rendimentos e Ganhos de Capital auferidos no Exterior",0,0,0,0]
["15. Variações Cambiais Ativas - Operações Liquidadas (MP 1.858-10/1999, art 30)",0,0,0,0]
{"$rows_left_out":22}
{"sheet":"IR 4º TRIM","index":6,"n_rows":41,"n_cols":5,"rows_kept":41,"cut":false,"hidden":false,"merged":[]}
[{"$f":"\"Empresa: \"&'TELA INICIAL'!I8","v":"Empresa: EMPRESA"}]
[{"$f":"\"Ano: \"&'TELA INICIAL'!I10","v":"Ano: 2025"}]
[]
["Ficha IRPJ 4º Trimestre","Outubro","Novembro","Dezembro","4º Trimestre"]
["DISCRIMINAÇÃO DA RECEITA BRUTA",{"$f":"SUM(B6:B9)","v":0},{"$f":"SUM(C6:C9)","v":0},{"$f":"SUM(D6:D9)","v":0},{"$f":"SUM(B5:D5)","v":0}]
["01. Receita Bruta sujeita ao Percentual de 1,6%",null,null,null,{"$f":"SUM(B6:D6)","v":0}]
["02. Receita Bruta sujeita ao Percentual de 8%",null,null,null,{"$f":"SUM(B7:D7)","v":0}]
["03. Receita Bruta sujeita ao Percentual de 16%",null,null,null,0]
["04. Receita Bruta sujeita ao Percentual de 32%",null,null,null,0]
["05. RESULTADO DA APLICAÇÃO DOS PERCENTUAIS SOBRE A RECEITA BRUTA",{"$f":"(B6*1.6%)+(B7*8%)+(B8*16%)+(B9*32%)","v":0},{"$f":"(C6*1.6%)+(C7*8%)+(C8*16%)+(C9*32%)","v":0},{"$f":"(D6*1.6%)+(D7*8%)+(D8*16%)+(D9*32%)","v":0},{"$f":"SUM(B10:D10)","v":0}]
["06. Rendimentos e Ganhos Líquidos Aplicações Renda Fixa/Renda Variável",null,null,null,{"$f":"SUM(B11:D11)","v":0}]
["07. Juros sobre o Capital Próprio",0,0,0,{"$f":"SUM(B12:D12)","v":0}]
["08. Lucro Inflacionário - Realização Obrigatória",0,0,0,0]
["09. Realização de Valores cuja Tributação tenha sido Diferida",0,0,0,0]
["10. Recuperação de Custos e Despesas",0,0,0,0]
["11. Ajustes Decorrentes de Métodos - Preços de Transferência",0,0,0,0]
["12. Multas e Vantagens Decorrentes de Rescisão Contratual",0,null,null,0]
["13. Lucros Disponibilizados no Exterior",0,0,0,0]
["14. Rendimentos e Ganhos de Capital auferidos no Exterior",0,0,0,0]
["15. Variações Cambiais Ativas - Operações Liquidadas (MP 1.858-10/1999, art 30)",0,0,0,0]
{"$rows_left_out":22}
{"sheet":"CSLL 1 TRIM","index":7,"n_rows":30,"n_cols":5,"rows_kept":30,"cut":false,"hidden":false,"merged":[]}
[{"$f":"\"Empresa: \"&'TELA INICIAL'!I8","v":"Empresa: EMPRESA"}]
[{"$f":"\"Ano: \"&'TELA INICIAL'!I10","v":"Ano: 2025"}]
[]
["Ficha 1º Trimestre CSLL","Janeiro","Fevereiro","Março","1º Trimestre"]
["CÁLCULO DA CSLL"]
["01. Receita Bruta 12%",null,null,null,{"$f":"SUM(B6:D6)","v":0}]
["01.1 Aplicação do Percentual sobre a Receita Bruta 12%",{"$f":"B6*12%","v":0},{"$f":"C6*12%","v":0},0,0]
["02. Receita Bruta 32%",0,null,0,0]
["02.1 Aplicação do Percentual sobre a Receita Bruta 32%",{"$f":"B8*32%","v":0},{"$f":"C8*32%","v":0},0,0]
["TOTAL da Aplicacao do Percentual sobre a Receita Bruta",{"$f":"B7+B9","v":0},{"$f":"C7+C9","v":0},0,0]
["03. Rendimentos e Ganhos Líquidos Aplicações Renda Fixa/Renda Variável",0,0,null,0]
["04. Juros sobre o Capital Próprio",null,null,null,0]
["05. Ajustes Decorrentes de Métodos - Preços de Transferência",null,null,null,0]
["06. Lucros Disponibilizados no Exterior",null,null,null,0]
["07. Rendimentos e Ganhos de Capital auferidos no Exterior",null,null,null,0]
["08. Variações Cambiais Ativas - Operações Liquidadas (MP 1.858-10/1999, art 30)",null,null,null,0]
["09. Demais Receitas",null,null,null,0]
["10. Ganhos de Capital",null,null,null,0]
["11. (-) Excedente de Variação Cambial (MP 1.858-10/1999. art. 31)",null,null,null,0]
["12. (-) Variações Cambiais Ativas (MP 1.858-10/1999, art. 30)",null,null,null,0]
{"$rows_left_out":11}
{"sheet":"CSLL 2 TRIM","index":8,"n_rows":30,"n_cols":5,"rows_kept":30,"cut":false,"hidden":false,"merged":[]}
[{"$f":"\"Empresa: \"&'TELA INICIAL'!I8","v":"Empresa: EMPRESA"}]
[{"$f":"\"Ano: \"&'TELA INICIAL'!I10","v":"Ano: 2025"}]
[]
["Ficha 2º Trimestre CSLL","Abril","Maio","Junho","2º Trimestre"]
["CÁLCULO DA CSLL"]
["01. Receita Bruta 12%",null,null,null,{"$f":"SUM(B6:D6)","v":0}]
["01.1 Aplicação do Percentual sobre a Receita Bruta 12%",{"$f":"B6*12%","v":0},{"$f":"C6*12%","v":0},0,0]
["02. Receita Bruta 32%",0,0,0,0]
["02.1 Aplicação do Percentual sobre a Receita Bruta 32%",{"$f":"B8*32%","v":0},{"$f":"C8*32%","v":0},0,0]
["TOTAL da Aplicacao do Percentual sobre a Receita Bruta",{"$f":"B7+B9","v":0},{"$f":"C7+C9","v":0},0,0]
["03. Rendimentos e Ganhos Líquidos Aplicações Renda Fixa/Renda Variável",0,0,null,0]
["04. Juros sobre o Capital Próprio",null,null,null,{"$f":"SUM(B12:D12)","v":0}]
["05. Ajustes Decorrentes de Métodos - Preços de Transferência",null,null,null,0]
["06. Lucros Disponibilizados no Exterior",null,null,null,0]
["07. Rendimentos e Ganhos de Capital auferidos no Exterior",null,null,null,0]
["08. Variações Cambiais Ativas - Operações Liquidadas (MP 1.858-10/1999, art 30)",null,null,null,0]
["09. Demais Receitas",null,null,null,0]
["10. Ganhos de Capital",null,null,null,0]
["11. (-) Excedente de Variação Cambial (MP 1.858-10/1999. art. 31)",null,null,null,0]
["12. (-) Variações Cambiais Ativas (MP 1.858-10/1999, art. 30)",null,null,null,0]
{"$rows_left_out":11}
{"sheet":"CSLL 3 TRIM","index":9,"n_rows":30,"n_cols":5,"rows_kept":30,"cut":false,"hidden":false,"merged":[]}
[{"$f":"\"Empresa: \"&'TELA INICIAL'!I8","v":"Empresa: EMPRESA"}]
[{"$f":"\"Ano: \"&'TELA INICIAL'!I10","v":"Ano: 2025"}]
[]
["Ficha 3º Trimestre CSLL","Julho","Agosto","Setembro","3º Trimestre"]
["CÁLCULO DA CSLL"]
["01. Receita Bruta 12%",null,null,null,{"$f":"SUM(B6:D6)","v":0}]
["01.1 Aplicação do Percentual sobre a Receita Bruta 12%",{"$f":"B6*12%","v":0},{"$f":"C6*12%","v":0},0,0]
["02. Receita Bruta 32%",0,0,null,0]
["02.1 Aplicação do Percentual sobre a Receita Bruta 32%",{"$f":"B8*32%","v":0},{"$f":"C8*32%","v":0},0,0]
["TOTAL da Aplicacao do Percentual sobre a Receita Bruta",{"$f":"B7+B9","v":0},{"$f":"C7+C9","v":0},0,0]
["03. Rendimentos e Ganhos Líquidos Aplicações Renda Fixa/Renda Variável",null,null,null,0]
["04. Juros sobre o Capital Próprio",null,null,null,0]
["05. Ajustes Decorrentes de Métodos - Preços de Transferência",null,null,null,0]
["06. Lucros Disponibilizados no Exterior",null,null,null,0]
["07. Rendimentos e Ganhos de Capital auferidos no Exterior",null,null,null,0]
["08. Variações Cambiais Ativas - Operações Liquidadas (MP 1.858-10/1999, art 30)",null,null,null,0]
["09. Demais Receitas",null,null,null,0]
["10. Ganhos de Capital",null,null,null,0]
["11. (-) Excedente de Variação Cambial (MP 1.858-10/1999. art. 31)",null,null,null,0]
["12. (-) Variações Cambiais Ativas (MP 1.858-10/1999, art. 30)",null,null,null,0]
{"$rows_left_out":11}
{"sheet":"CSLL 4 TRIM","index":10,"n_rows":30,"n_cols":5,"rows_kept":30,"cut":false,"hidden":false,"merged":[]}
[{"$f":"\"Empresa: \"&'TELA INICIAL'!I8","v":"Empresa: EMPRESA"}]
[{"$f":"\"Ano: \"&'TELA INICIAL'!I10","v":"Ano: 2025"}]
[]
["Ficha 4º Trimestre CSLL","Outubro","Novembro","Dezembro","4º Trimestre"]
["CÁLCULO DA CSLL"]
["01. Receita Bruta 12%",null,null,null,{"$f":"SUM(B6:D6)","v":0}]
["01.1 Aplicação do Percentual sobre a Receita Bruta 12%",{"$f":"B6*12%","v":0},{"$f":"C6*12%","v":0},0,0]
["02. Receita Bruta 32%",null,null,null,0]
["02.1 Aplicação do Percentual sobre a Receita Bruta 32%",{"$f":"B8*32%","v":0},{"$f":"C8*32%","v":0},0,0]
["TOTAL da Aplicacao do Percentual sobre a Receita Bruta",{"$f":"B7+B9","v":0},{"$f":"C7+C9","v":0},0,0]
["03. Rendimentos e Ganhos Líquidos Aplicações Renda Fixa/Renda Variável",null,null,null,0]
["04. Juros sobre o Capital Próprio",null,null,null,0]
["05. Ajustes Decorrentes de Métodos - Preços de Transferência",null,null,null,0]
["06. Lucros Disponibilizados no Exterior",null,null,null,0]
["07. Rendimentos e Ganhos de Capital auferidos no Exterior",null,null,null,0]
["08. Variações Cambiais Ativas - Operações Liquidadas (MP 1.858-10/1999, art 30)",null,null,null,0]
["09. Demais Receitas",null,null,null,0]
["10. Ganhos de Capital",null,null,null,0]
["11. (-) Excedente de Variação Cambial (MP 1.858-10/1999. art. 31)",null,null,null,0]
["12. (-) Variações Cambiais Ativas (MP 1.858-10/1999, art. 30)",null,null,null,0]
{"$rows_left_out":11}
{"sheet":"PIS","index":11,"n_rows":39,"n_cols":13,"rows_kept":39,"cut":false,"hidden":false,"merged":[]}
[]
[]
[]
[null,"Janeiro","Fevereiro","Março","Abril","Maio","Junho","Julho","Agosto","Setembro","Outubro","Novembro","Dezembro"]
["DEMONSTRAÇÃO DA BASE DE CÁLCULO DA CONTRIBUIÇÃO PARA O PIS/PASEP"]
["01. Faturamento/Receita Bruta",{"$f":"'IR 1 TRIM'!B5","v":0},{"$f":"'IR 1 TRIM'!C5","v":0},{"$f":"'IR 1 TRIM'!D5","v":0},{"$f":"'IR 2 TRIM'!B5","v":0},{"$f":"'IR 2 TRIM'!C5","v":0},{"$f":"'IR 2 TRIM'!D5","v":0},{"$f":"'IR 3 TRIM'!B5","v":0},{"$f":"'IR 3 TRIM'!C5","v":0},{"$f":"'IR 3 TRIM'!D5","v":0},{"$f":"'IR 4º TRIM'!B5","v":0},{"$f":"'IR 4º TRIM'!C5","v":0},{"$f":"'IR 4º TRIM'!D5","v":0}]
["02. Receita de Variações Cambiais - Operações Liquidadas no Mês"]
["03. Receitas Diferidas em Períodos Anteriores"]
["ISENÇÕES E EXCLUSÕES"]
["04. (-) Receitas Isentas"]
["05. (-) Vendas Canceladas, Devoluções e Descontos Incondicionais"]
["06. (-) IPI e ICMS/Substituto Tributário"]
["07. (-) Receitas de Variações Cambiais Auferidas no Mês"]
["08. (-) Reversão Prov. Recup. Créditos Baixados como Perda"]
["09. (-) Resultados Positivos em Participações Societárias e em SCP"]
["10. (-) Vendas de Bens do Ativo Permanente"]
["11. (-) Vendas de Produtos/Mercadorias Sujeitas à Substituição"]
["12. (-) Vendas de Produtos/Mercadorias com Alíquotas Diferenciadas"]
["13. (-) Receitas Diferidas no Período"]
["14. (-) Exclusões Permitidas às Sociedades Cooperativas"]
{"$rows_left_out":20}
{"sheet":"COFINS","index":12,"n_rows":39,"n_cols":13,"rows_kept":39,"cut":false,"hidden":false,"merged":[]}
[]
[]
[]
[null,"Janeiro","Fevereiro","Março","Abril","Maio","Junho","Julho","Agosto","Setembro","Outubro","Novembro","Dezembro"]
["DEMONSTRAÇÃO DA BASE DE CÁLCULO DA CONTRIBUIÇÃO PARA A COFINS"]
["01. Faturamento/Receita Bruta",{"$f":"'IR 1 TRIM'!B5","v":0},{"$f":"'IR 1 TRIM'!C5","v":0},{"$f":"'IR 1 TRIM'!D5","v":0},{"$f":"'IR 2 TRIM'!B5","v":0},{"$f":"'IR 2 TRIM'!C5","v":0},{"$f":"'IR 2 TRIM'!D5","v":0},{"$f":"'IR 3 TRIM'!B5","v":0},{"$f":"'IR 3 TRIM'!C5","v":0},{"$f":"'IR 3 TRIM'!D5","v":0},{"$f":"'IR 4º TRIM'!B5","v":0},{"$f":"'IR 4º TRIM'!C5","v":0},{"$f":"'IR 4º TRIM'!D5","v":0}]
["02. Receita de Variações Cambiais - Operações Liquidadas no Mês"]
["03. Receitas Diferidas em Períodos Anteriores"]
["ISENÇÕES E EXCLUSÕES"]
["04. (-) Receitas Isentas"]
["05. (-) Vendas Canceladas, Devoluções e Descontos Incondicionais"]
["06. (-) IPI e ICMS/Substituto Tributário"]
["07. (-) Receitas de Variações Cambiais Auferidas no Mês"]
["08. (-) Reversão Prov. Recup. Créditos Baixados como Perda"]
["09. (-) Resultados Positivos em Participações Societárias e em SCP"]
["10. (-) Vendas de Bens do Ativo Permanente"]
["11. (-) Vendas de Produtos/Mercadorias Sujeitas à Substituição"]
["12. (-) Vendas de Produtos/Mercadorias com Alíquotas Diferenciadas"]
["13. (-) Receitas Diferidas no Período"]
["14. (-) Exclusões Permitidas às Sociedades Cooperativas"]
{"$rows_left_out":20}
{"sheet":"Relatório","index":13,"n_rows":202,"n_cols":16378,"rows_kept":202,"cut":false,"hidden":false,"merged":[[3,2,3,5]]}
[]
[]
[null,null,null,null,null,null,{"$f":"TODAY()","v":"2025-07-29"}]
[null,null,{"$f":"\"DEMONSTRATIVO EMPRESA \"&'TELA INICIAL'!I8&\"ANO \"&'TELA INICIAL'!I10","v":"DEMONSTRATIVO EMPRESA EMPRESAANO 2025"}]
[]
[]
[null,"Mês","Receita Bruta","IRPJ à pagar","CSLL à pagar","PIS à pagar","Cofins à pagar"]
[null,"Janeiro",{"$f":"COFINS!B6","v":0},{"$f":"'IR 1 TRIM'!B40","v":0},{"$f":"'CSLL 1 TRIM'!B28","v":0},{"$f":"PIS!B36","v":0},{"$f":"COFINS!B36","v":0}]
[null,"Fevereiro",{"$f":"PIS!C6","v":0},{"$f":"'IR 1 TRIM'!C40","v":0},{"$f":"'CSLL 1 TRIM'!C28","v":0},{"$f":"PIS!C36","v":0},{"$f":"COFINS!C36","v":0}]
[null,"Março",{"$f":"COFINS!D6","v":0},{"$f":"'IR 1 TRIM'!D40","v":0},{"$f":"'CSLL 1 TRIM'!D28","v":0},{"$f":"PIS!D36","v":-500},{"$f":"COFINS!D36","v":0}]
[null,"Abril",{"$f":"COFINS!E6","v":0},{"$f":"'IR 2 TRIM'!B40","v":0},{"$f":"'CSLL 2 TRIM'!B28","v":0},{"$f":"PIS!E36","v":0},{"$f":"COFINS!E36","v":0}]
[null,"Maio",{"$f":"COFINS!F6","v":0},{"$f":"'IR 2 TRIM'!C40","v":0},{"$f":"'CSLL 2 TRIM'!C28","v":0},{"$f":"PIS!F36","v":0},{"$f":"COFINS!F36","v":0}]
[null,"Junho",{"$f":"COFINS!G6","v":0},{"$f":"'IR 2 TRIM'!D40","v":0},{"$f":"'CSLL 2 TRIM'!D28","v":0},{"$f":"PIS!G36","v":0},{"$f":"COFINS!G36","v":0}]
[null,"Julho",{"$f":"COFINS!H6","v":0},{"$f":"'IR 3 TRIM'!B40","v":0},{"$f":"'CSLL 3 TRIM'!B28","v":0},{"$f":"PIS!H36","v":0},{"$f":"COFINS!H36","v":0}]
[null,"Agosto",{"$f":"COFINS!I6","v":0},{"$f":"'IR 3 TRIM'!C40","v":0},{"$f":"'CSLL 3 TRIM'!C28","v":0},{"$f":"PIS!I36","v":0},{"$f":"COFINS!I36","v":0}]
[" ","Setembro",{"$f":"COFINS!J6","v":0},{"$f":"'IR 3 TRIM'!D40","v":0},{"$f":"'CSLL 3 TRIM'!D28","v":0},{"$f":"PIS!J36","v":0},{"$f":"COFINS!J36","v":0}]
[null,"Outubro",{"$f":"COFINS!K6","v":0},{"$f":"'IR 4º TRIM'!B40","v":0},{"$f":"'CSLL 4 TRIM'!B28","v":0},{"$f":"PIS!K36","v":0},{"$f":"COFINS!K36","v":0}]
[null,"Novembro",{"$f":"COFINS!L6","v":0},{"$f":"'IR 4º TRIM'!C40","v":0},{"$f":"'CSLL 4 TRIM'!C28","v":0},{"$f":"PIS!L36","v":0},{"$f":"COFINS!L36","v":0}]
[null,"Dezembro",{"$f":"COFINS!M6","v":0},{"$f":"'IR 4º TRIM'!D40","v":-0.99},{"$f":"'CSLL 4 TRIM'!D28","v":0},{"$f":"PIS!M36","v":0},{"$f":"COFINS!M36","v":0}]
[null,"Total:",{"$f":"SUM(C8:C19)","v":0},{"$f":"SUM(D8:D19)","v":-0.99},0,-500,{"$f":"SUM(G8:G19)","v":0}]
{"$rows_left_out":183}
{"sheet":"DASHBOARD","index":14,"n_rows":19,"n_cols":17,"rows_kept":19,"cut":false,"hidden":false,"merged":[[7,1,9,1],[7,2,9,2],[12,1,12,3]]}
[]
[]
[]
[]
[]
[null,"Verificação: "]
[null,null,null,null,null,null,"Mês","Valor",null,null,null,null,null,null,null,2,{"$f":"VLOOKUP(P7,Configs!$I$4:$J$8,2,FALSE)","v":"IRPJ à pagar"}]
[null,"Total Anual:",{"$f":"SUM(H8:H19)","v":-0.99},null,null,null,"Janeiro",{"$f":"INDEX(TbBase[#Data],MATCH(G8,TbBase[Mês],0),MATCH($Q$7,TbBase[#Headers],0))","v":0}]
[null,null,null,null,null,null,"Fevereiro",{"$f":"INDEX(TbBase[#Data],MATCH(G9,TbBase[Mês],0),MATCH($Q$7,TbBase[#Headers],0))","v":0},null,null,null,null,null,null,null,null,{"$f":"Q7&\" ano \"&'TELA INICIAL'!I10","v":"IRPJ à pagar ano 2025"}]
[null,null,null,null,null,null,"Março",{"$f":"INDEX(TbBase[#Data],MATCH(G10,TbBase[Mês],0),MATCH($Q$7,TbBase[#Headers],0))","v":0}]
[null,null,null,null,null,null,"Abril",{"$f":"INDEX(TbBase[#Data],MATCH(G11,TbBase[Mês],0),MATCH($Q$7,TbBase[#Headers],0))","v":0}]
[null,null,null,null,null,null,"Maio",{"$f":"INDEX(TbBase[#Data],MATCH(G12,TbBase[Mês],0),MATCH($Q$7,TbBase[#Headers],0))","v":0}]
[null,"Análise trimestral",null,null,null,null,"Junho",{"$f":"INDEX(TbBase[#Data],MATCH(G13,TbBase[Mês],0),MATCH($Q$7,TbBase[#Headers],0))","v":0}]
[null,"1º Trim.",{"$f":"SUM(H8:H10)","v":0},null,null,null,"Julho",{"$f":"INDEX(TbBase[#Data],MATCH(G14,TbBase[Mês],0),MATCH($Q$7,TbBase[#Headers],0))","v":0}]
[null,"2ª Trim.",{"$f":"SUM(H11:H13)","v":0},{"$f":"IF(C15>C14,\"▲\",IF(C15=C14,\"►◄\",\"▼\"))","v":"►◄"},null,null,"Agosto",{"$f":"INDEX(TbBase[#Data],MATCH(G15,TbBase[Mês],0),MATCH($Q$7,TbBase[#Headers],0))","v":0}]
[null,"3º Trim.",{"$f":"SUM(H14:H16)","v":0},{"$f":"IF(C16>C15,\"▲\",IF(C16=C15,\"►◄\",\"▼\"))","v":"►◄"},null,null,"Setembro",{"$f":"INDEX(TbBase[#Data],MATCH(G16,TbBase[Mês],0),MATCH($Q$7,TbBase[#Headers],0))","v":0}]
[null,"4º Trim.",{"$f":"SUM(H17:H19)","v":-0.99},"▼",null,null,"Outubro",{"$f":"INDEX(TbBase[#Data],MATCH(G17,TbBase[Mês],0),MATCH($Q$7,TbBase[#Headers],0))","v":0}]
[null,null,null,null,null,null,"Novembro",{"$f":"INDEX(TbBase[#Data],MATCH(G18,TbBase[Mês],0),MATCH($Q$7,TbBase[#Headers],0))","v":0}]
[null,null,null,null,null,null,"Dezembro",{"$f":"INDEX(TbBase[#Data],MATCH(G19,TbBase[Mês],0),MATCH($Q$7,TbBase[#Headers],0))","v":-0.99}]

{"sheet":"Configs","index":15,"n_rows":30,"n_cols":13,"rows_kept":30,"cut":false,"hidden":false,"merged":[]}
[]
[null,"Mês","Receita Bruta","IRPJ à pagar","CSLL à pagar","PIS à pagar","Cofins à pagar"]
[null,"Janeiro",{"$f":"Relatório!C8","v":0},{"$f":"Relatório!D8","v":0},{"$f":"Relatório!E8","v":0},{"$f":"Relatório!F8","v":0},{"$f":"Relatório!G8","v":0}]
[null,"Fevereiro",{"$f":"Relatório!C9","v":0},{"$f":"Relatório!D9","v":0},{"$f":"Relatório!E9","v":0},{"$f":"Relatório!F9","v":0},{"$f":"Relatório!G9","v":0},null,1,"Receita Bruta",null,null,"Janeiro"]
[null,"Março",{"$f":"Relatório!C10","v":0},{"$f":"Relatório!D10","v":0},{"$f":"Relatório!E10","v":0},{"$f":"Relatório!F10","v":-500},{"$f":"Relatório!G10","v":0},null,2,"IRPJ à pagar",null,null,"Fevereiro"]
[null,"Abril",{"$f":"Relatório!C11","v":0},{"$f":"Relatório!D11","v":0},{"$f":"Relatório!E11","v":0},{"$f":"Relatório!F11","v":0},{"$f":"Relatório!G11","v":0},null,3,"CSLL à pagar",null,null,"Março"]
[null,"Maio",{"$f":"Relatório!C12","v":0},{"$f":"Relatório!D12","v":0},{"$f":"Relatório!E12","v":0},{"$f":"Relatório!F12","v":0},{"$f":"Relatório!G12","v":0},null,4,"PIS à pagar",null,null,"Abril"]
[null,"Junho",{"$f":"Relatório!C13","v":0},{"$f":"Relatório!D13","v":0},{"$f":"Relatório!E13","v":0},{"$f":"Relatório!F13","v":0},{"$f":"Relatório!G13","v":0},null,5,"Cofins à pagar",null,null,"Maio"]
[null,"Julho",{"$f":"Relatório!C14","v":0},{"$f":"Relatório!D14","v":0},{"$f":"Relatório!E14","v":0},{"$f":"Relatório!F14","v":0},{"$f":"Relatório!G14","v":0},null,null,null,null,null,"Junho"]
[null,"Agosto",{"$f":"Relatório!C15","v":0},{"$f":"Relatório!D15","v":0},{"$f":"Relatório!E15","v":0},{"$f":"Relatório!F15","v":0},{"$f":"Relatório!G15","v":0},null,null,null,null,null,"Julho"]
[null,"Setembro",{"$f":"Relatório!C16","v":0},{"$f":"Relatório!D16","v":0},{"$f":"Relatório!E16","v":0},{"$f":"Relatório!F16","v":0},{"$f":"Relatório!G16","v":0},null,null,null,null,null,"Agosto"]
[null,"Outubro",{"$f":"Relatório!C17","v":0},{"$f":"Relatório!D17","v":0},{"$f":"Relatório!E17","v":0},{"$f":"Relatório!F17","v":0},{"$f":"Relatório!G17","v":0},null,null,null,null,null,"Setembro"]
[null,"Novembro",{"$f":"Relatório!C18","v":0},{"$f":"Relatório!D18","v":0},{"$f":"Relatório!E18","v":0},{"$f":"Relatório!F18","v":0},{"$f":"Relatório!G18","v":0},null,null,null,null,null,"Outubro"]
[null,"Dezembro",{"$f":"Relatório!C19","v":0},{"$f":"Relatório!D19","v":-0.99},{"$f":"Relatório!E19","v":0},{"$f":"Relatório!F19","v":0},{"$f":"Relatório!G19","v":0},null,null,null,null,null,"Novembro"]
[null,null,null,null,null,null,null,null,null,null,null,null,"Dezembro"]
[]
[null,"Rótulos de Linha","Soma de Receita Bruta"]
[null,"Janeiro",2442246.8199999998]
[null,"Fevereiro",2249395.5299999998]
[null,"Março",2010350.88]
{"$rows_left_out":10}